首页 技术文章 后端开发 php7.2运行失败怎么办
正文 评论

php7.2运行失败怎么办

php7.2运行失败的解决办法:1、在PHP源码目录下执行“vi Makefile”;2、找到EXTRA_LIBS行;3、在行末添加“-llber”;4、保存退出并再次make即可。

php7.2运行失败怎么办

本文操作环境:Windows7系统,PHP7.2版,Dell G3电脑。

php7.2运行失败怎么办?

php7.2 编译遇到的坑

checking size of long int... (cached) 8
configure: error: Cannot find ldap libraries in /usr/lib.

解决:

./configure php的时候出现下面错误而退出

configure: error: Cannot find ldap libraries in /usr/lib

解决办法:

cp -frp /usr/lib64/libldap* /usr/lib/

然后再./configure ...即可

/usr/bin/ld: ext/ldap/.libs/ldap.o: undefined reference to symbol 'ber_strdup' 
//usr/lib64/liblber-2.4.so.2: error adding symbols: DSO missing from command line 
collect2: error: ld returned 1 exit status 
make: *** [sapi/cli/php] Error 1

解决办法:遇到这种类似的情况,说明「./configure 」沒抓好一些环境变数值。

解决方法,来自老外的一篇文章:

在PHP源码目录下 vi Makefile 找到 EXTRA_LIBS 行,在行末添加 ‘ -llber ‘ 保存退出再次make即可

/usr/local/src/php-7.2.7/sapi/cli/php: error while loading shared libraries: libiconv.so.2: cannot open shared object file: No such file or directory
make: *** [ext/phar/phar.php] Error 127

解决:

1.先

#vi /etc/ld.so.conf

在里面加上一行 /usr/local/lib

2.然后运行/sbin/ldconfig

 #/sbin/ldconfig

编译make

Generating phar.phar
 
chmod: cannot access ‘ext/phar/phar.phar’: No such file or directory
make: [ext/phar/phar.phar] Error 1 (ignored)

解决:

cd ext/phar/
cp ./phar.php ./phar.phar

推荐学习:《PHP视频教程》

以上就是php7.2运行失败怎么办的详细内容,更多请关注主题君其它相关文章!

-=||=-收藏赞 (0)
更多主题
单栏极简文艺WordPress博客主题:Diaspora主题
¥ 0 关注:20,393
详情
简约黑白WordPress个人博客主题:Personal主题
¥ 0 关注:20,242
详情
v1.0.0
小程序收录免费WordPress主题:XCX主题
¥ 0 关注:20,050
详情
v1.0.0
一款简约单栏的免费WordPress博客主题:itheme主题
¥ 0 关注:18,251
详情
功能丰富切轻量的WordPress虚拟资源主题:Rizhuti主题
¥ 599 关注:18,208
详情
大气优雅免费WordPress博客主题:HONEY主题
¥ 0 关注:15,047
详情
回复
暂无评论

不要再留垃圾评论了,主题君整理资源不容易,留几句鼓励的话吧。